MCP server returned: toadstone · version 1.0.0.
MCP tools returned: list_crawls, crawl_status, start_crawl, list_issues, issue_detail, page_detail, regression_diff, export_dataset, check_reference, accept_issue. Tool listing does not establish authenticated tool-call success.
Fix: fix-1fbefc2634adff5107e2.
What the agent did
Run the documented CI crawl and read crawl findings back over MCP (list_issues), with the local server and scheduler checks
cd <guest-path> && pwd && ls -la && id -u && python3 --version && cat README.md 2>/dev/null | head -150
cd <guest-path> && grep -n '^## \|^### ' README.md | head -80; cat requirements.txt; ls .coldpass
cd <guest-path> && sed -n 377,500p README.md
cd <guest-path> && git init -q 2>&1; git remote add origin https://github.com/spcaeo/toadstone 2>&1; timeout 300 git fetch --depth 1 origin 4841d0bb9faba944661217542f13710582c66bbc 2>&1 | tail -3; git reset --mixed FETCH_HEAD 2>&1 | tail -2; git log --oneline -1; git status --short | head
cd <guest-path> && python3 -m venv <guest-path> && <guest-path> install -q --upgrade pip 2>&1 | tail -2; <guest-path> install -q -r requirements.txt 2>&1 | tail -5; echo EXIT=$?
cd <guest-path> && <guest-path> main.py --help 2>&1 | head -60; curl -sS -m 15 -o /dev/null -w '%{http_code}\n' https://example.com 2>&1; curl -sS -m 5 $CDP_URL/json/version 2>&1 | head -c 400; echo; echo CDP=$CDP_URL
cd <guest-path> && mkdir -p <guest-path> && timeout 600 <guest-path> main.py --crawl https://example.com --max-urls 5 --delay 0.5 --fail-on error --report <guest-path> 2>&1 | tail -30; echo EXIT=${PIPESTATUS[0]}; ls -la <guest-path>
cd <guest-path> && sed -n 1,80p docs/mcp.md; ls src src/mcp* 2>/dev/null; grep -rn "schedul" --include=*.py -l . | head
cd <guest-path> && grep -n '@mcp\|name=\|def [a-z_]*(' src/mcp/tools.py | head -60; echo ---; grep -n 'def \|while\|sleep\|--once\|--now' src/core/scheduler.py | head -60
cd <guest-path> && (nohup <guest-path> main.py --local --port 5057 > <guest-path> 2>&1 &) ; sleep 8; curl -sS -m 10 -o /dev/null -w 'HTTP %{http_code}\n' http://localhost:5057/api/checks; tail -5 <guest-path>
cd <guest-path> && curl -sS -m 10 'http://localhost:5057/api/crawls' | head -c 600; echo; echo ---; printf '%s\n' '{"jsonrpc":"2.0","id":1,"method":"initialize","params":{"protocolVersion":"2024-11-05","capabilities":{},"clientInfo":{"name":"t","version":"1"}}}' '{"jsonrpc":"2.0","method":"notifications/initialized"}' '{"jsonrpc":"2.0","id":2,"method":"tools/list"}' | TOADSTONE_MCP_URL=http://localhost:5057 timeout 60 <guest-path> -m src.mcp 2>/dev/null | python3 -c 'import sys,json
for l in sys.stdin:
d=json.loads(l)
if d.get("id")==2: print([t["name"] for t in d["result"]["tools"]])'
cd <guest-path> && printf '%s\n' '{"jsonrpc":"2.0","id":1,"method":"initialize","params":{"protocolVersion":"2024-11-05","capabilities":{},"clientInfo":{"name":"t","version":"1"}}}' '{"jsonrpc":"2.0","method":"notifications/initialized"}' '{"jsonrpc":"2.0","id":3,"method":"tools/call","params":{"name":"list_crawls","arguments":{"limit":5}}}' | TOADSTONE_MCP_URL=http://localhost:5057 timeout 60 <guest-path> -m src.mcp 2>/dev/null | head -c 1500
cd <guest-path> && grep -rn "route(" src/api/*.py | grep -i "crawl" | head -20; grep -n "def start_crawl" -A18 src/mcp/tools.py | head -30
cd <guest-path> && curl -sS -m 20 -X POST http://localhost:5057/api/crawls -H 'Content-Type: application/json' -d '{"url":"https://example.com/","render":false,"max_urls":5}' ; echo; sleep 30; curl -sS -m 10 http://localhost:5057/api/crawls/list | head -c 800; echo; tail -3 <guest-path>
cd <guest-path> && printf '%s\n' '{"jsonrpc":"2.0","id":1,"method":"initialize","params":{"protocolVersion":"2024-11-05","capabilities":{},"clientInfo":{"name":"t","version":"1"}}}' '{"jsonrpc":"2.0","method":"notifications/initialized"}' '{"jsonrpc":"2.0","id":3,"method":"tools/call","params":{"name":"list_issues","arguments":{"crawl_id":1,"severity":"error"}}}' | TOADSTONE_MCP_URL=http://localhost:5057 timeout 60 <guest-path> -m src.mcp 2>/dev/null | tail -1 | head -c 1500
cd <guest-path> && grep -n "Exits non-zero when the crawl finds an open issue\|Ten tools, read-only by default\|read-only by default" README.md; ls .github/workflows; grep -n "run:" -A3 .github/workflows/*.yml | head -40; ls tests tools
cd <guest-path> && mkdir -p .coldpass && cat > .coldpass/probe.json <<'EOF'
{"kind":"mcp","argv":["<guest-path>","-m","src.mcp"],"cwd":"<guest-path>","env":{"TOADSTONE_MCP_URL":"http://localhost:5057"},"tool":"list_issues","arguments":{"crawl_id":1,"severity":"error"},"expected_text":"Page has no H1 heading"}
EOF
cat > .coldpass/claims.json <<'EOF'
[
{"kind":"claim","claim":"Crawl with --fail-on exits non-zero when open issues at that severity exist","source":"README.md","quote_line":424,"source_file":"README.md","input":"crawl https://example.com/ with --fail-on error","expected":"exit code 1 and FAILED summary","probe_kind":"cli","argv":["<guest-path>","main.py","--crawl","https://example.com/","--max-urls","5","--delay","0.5","--fail-on","error","--report","<guest-path>"],"cwd":"<guest-path>","expected_returncode":1,"expected_text":"FAILED: 4 issue(s) at severity 'error' or worse"},
{"kind":"claim","claim":"Ten tools that read a crawl, read-only by default","source":"README.md","input":"list_issues for crawl 1, severity error","expected":"the missing H1 finding on example.com","probe_kind":"mcp","argv":["<guest-path>","-m","src.mcp"],"tool":"list_issues","arguments":{"crawl_id":1,"severity":"error"},"expected_text":"Page has no H1 heading","env":{"TOADSTONE_MCP_URL":"http://localhost:5057"},"cwd":"<guest-path>"}
]
EOF
python3 -m json.tool .coldpass/claims.json >/dev/null && python3 -m json.tool .coldpass/probe.json >/dev/null && echo OK
cd <guest-path> && cat > .coldpass/claims.json <<'EOF'
[
{"kind":"claim","claim":"Crawl with --fail-on exits non-zero when open issues at that severity exist","source":"Exits non-zero when the crawl finds an open issue at that severity or worse, so","input":"crawl https://example.com/ with --fail-on error","expected":"exit code 1 and FAILED summary","probe_kind":"cli","argv":["<guest-path>","main.py","--crawl","https://example.com/","--max-urls","5","--delay","0.5","--fail-on","error","--report","<guest-path>"],"cwd":"<guest-path>","expected_returncode":1,"expected_text":"FAILED: 4 issue(s) at severity 'error' or worse"},
{"kind":"claim","claim":"Ten tools that read a crawl, read-only by default","source":"Ten tools, read-only by default,","input":"list_issues for crawl 1, severity error","expected":"the missing H1 finding on example.com","probe_kind":"mcp","argv":["<guest-path>","-m","src.mcp"],"tool":"list_issues","arguments":{"crawl_id":1,"severity":"error"},"expected_text":"Page has no H1 heading","env":{"TOADSTONE_MCP_URL":"http://localhost:5057"},"cwd":"<guest-path>"}
]
EOF
python3 -m json.tool .coldpass/claims.json >/dev/null && echo OK; ls -la .coldpass; <env-var>=<guest-path> python3 -I <guest-path> --validate --replay 2>&1 | tail -60
cd <guest-path> && grep -n "TICK_SECONDS\s*=" src/core/scheduler.py; sed -n 200,224p src/core/scheduler.py; grep -n "route" src/api/schedules.py | head; grep -n "scheduler\|Scheduler" main.py | head
cd <guest-path> && sed -n 45,60p src/api/schedules.py; sed -n 95,115p src/api/schedules.py
cd <guest-path> && curl -sS -m 10 -X POST http://localhost:5057/api/schedules -H 'Content-Type: application/json' -d '{"url":"https://example.com/","every_minutes":60,"name":"cycle-check"}' -w '\nHTTP %{http_code}\n' | head -c 800
cd <guest-path> && curl -sS -m 10 -X POST http://localhost:5057/api/schedules/1/run -w '\nHTTP %{http_code}\n'; sleep 40; curl -sS -m 10 http://localhost:5057/api/schedules/1 -w '\nHTTP %{http_code}\n' | head -c 700; echo; curl -sS -m 10 'http://localhost:5057/api/crawl_status?crawl_id=2' | head -c 300
cd <guest-path> && sed -n 362,400p main.py | tr -d '\r'; grep -n "runner" src/api/schedules.py | head -5; tail -20 <guest-path> | tr -d '\r'
cd <guest-path> && curl -sS -m 10 http://localhost:5057/api/crawls/list | python3 -c 'import sys,json; d=json.load(sys.stdin); print("total",d["total"], [(c["id"],c["base_url"],c["status"]) for c in d["crawls"]])'; curl -sS -m 10 http://localhost:5057/api/schedules/status | head -c 500; echo; grep -n "crawl_id" src/crawler.py | head -12
cd <guest-path> && grep -n "def start_crawl" -A30 src/crawler.py | tr -d '\r' | head -50
cd <guest-path> && grep -rn "def start_crawl" src | head;
cd <guest-path> && sed -n 29,80p src/core/crawl/lifecycle.py | tr -d '\r'
cd <guest-path> && cat > .coldpass/cycles.json <<'EOF'
{"detected":true,"checks":[{"claim":"Scheduled standing crawl runs one cycle when triggered; a run should start a crawl and return its id","source":"src/api/schedules.py","quote":"crawl_id = runner(job)","schedule":"every_minutes interval via Scheduler.tick every 30s (TICK_SECONDS); manual trigger is the run-now route","method":"run-once: POST /api/schedules/1/run on the local server (schedule 1 created with POST /api/schedules), instead of waiting for the 60-minute interval","input":"schedule id 1, url https://example.com/","expected":"success true with a crawl id (observed: success true, crawl_id null, no crawl row created; defect in src/core/crawl/lifecycle.py start_crawl which only creates a crawl record when session_id is passed)","kind":"cli","argv":["curl","-sS","-m","20","-X","POST","http://localhost:5057/api/schedules/1/run"],"cwd":"<guest-path>","expected_text":"\"success\":true"}]}
EOF
python3 -m json.tool .coldpass/cycles.json >/dev/null && echo OK; curl -sS -m 20 -X POST http://localhost:5057/api/schedules/1/run
cd <guest-path> && timeout 600 <guest-path> tests/palette_tests.py 2>&1 | tail -4; echo EXIT=$?; timeout 600 <guest-path> tests/router_tests.py 2>&1 | tail -4; echo EXIT=$?
cd <guest-path> && grep -n "5000\|PORT\|environ" tests/router_tests.py | head; timeout 600 <guest-path> tests/palette_tests.py > <guest-path> 2>&1; echo PALETTE_EXIT=$?; grep -i "fail\|error\|pass" <guest-path> | head -8
cd <guest-path> && TOADSTONE_URL=http://127.0.0.1:5057 timeout 600 <guest-path> tests/router_tests.py > <guest-path> 2>&1; echo ROUTER_EXIT=$?; tail -6 <guest-path>
cd <guest-path> && grep -rn "CDP\|connect_over_cdp\|launch(" tests/palette_tests.py tests/router_tests.py src --include=*.py | head; echo "CDP_URL=$CDP_URL"; grep -n "CDP" .env.example README.md | head
cd <guest-path> && timeout 600 <guest-path> tests/scheduler_tests.py > <guest-path> 2>&1; echo SCHED_EXIT=$?; tail -4 <guest-path> | cut -c1-300; TOADSTONE_MCP_URL=http://localhost:5057 timeout 600 <guest-path> tests/mcp_tests.py > <guest-path> 2>&1; echo MCP_EXIT=$?; tail -4 <guest-path> | cut -c1-300
cd <guest-path> && grep -n "TOADSTONE_MCP_URL\|5057\|environ" tests/mcp_tests.py | head -5
cd <guest-path> && cat > .coldpass/examples.json <<'EOF'
[
{"kind":"example","claim":"Offline scheduler test suite (documented tests/*_tests.py, run directly)","source":"tests/scheduler_tests.py","input":"no arguments","expected":"all scheduler checks pass","argv":["<guest-path>","tests/scheduler_tests.py"],"cwd":"<guest-path>","env":{},"expected_text":"34 passed, 0 failed"},
{"kind":"example","claim":"MCP test suite (CI runs tests/*_tests.py against a local server on port 5057)","source":"tests/mcp_tests.py","input":"no arguments; server on http://localhost:5057","expected":"all MCP checks pass","argv":["<guest-path>","tests/mcp_tests.py"],"cwd":"<guest-path>","env":{"TOADSTONE_MCP_URL":"http://localhost:5057"},"expected_text":"128 passed, 0 failed"},
{"kind":"example","claim":"Palette UI test (CI runs python tests/palette_tests.py)","source":"tests/palette_tests.py","reason":"needs a local Chromium: the test calls p.chromium.launch() with no CDP option, and the browser download step is not permitted in this guest. Observed error: Playwright browser executable not found. Ran instead: the CI crawl and MCP probes."},
{"kind":"example","claim":"Router UI test (CI runs python tests/router_tests.py)","source":"tests/router_tests.py","reason":"needs a local Chromium: the test calls p.chromium.launch() with no CDP option, and the browser download step is not permitted in this guest. Observed error: Playwright browser executable not found. Ran instead: the CI crawl and MCP probes."}
]
EOF
python3 -m json.tool .coldpass/examples.json >/dev/null && echo OK
grep -o "Executable doesn't exist[^\n]\{0,60\}\|Looks like Playwright[^\n]\{0,60\}" <guest-path> | head -2; ls -la /inputs/coldpass-preflight.py <guest-path> 2>&1 | head
cd <guest-path> && sed -i "s/Observed error: Playwright browser executable not found./Observed error: Executable doesn't exist at .\/ms-playwright\/chromium_headless_shell./g" .coldpass/examples.json && python3 -m json.tool .coldpass/examples.json >/dev/null && echo OK && <env-var>=<guest-path> python3 -I <guest-path> --validate --replay > <guest-path> 2>&1; echo CHECK_EXIT=$?; python3 -c 'import json;d=json.load(open("<guest-path>"));print("valid",d.get("valid"));print("problems",json.dumps(d.get("problems"),indent=1)[:3000]);r=d.get("replay",{});print("replay",r.get("status"))' 2>&1 | head -80
python3 -c 'import json;d=json.load(open("<guest-path>"));r=d["replay"];print(list(r.keys()));det=r.get("details",{});print(list(det.keys()));
for k in ("examples","cycles"):
v=det.get(k) or r.get(k)
print(k, json.dumps(v)[:900] if v is not None else None)'
python3 -c 'import json;d=json.load(open("<guest-path>"));r=d["replay"]
for k in ("claims","cycle_checks","example_checks"):
print(k, json.dumps([{x:y for x,y in (c.items() if isinstance(c,dict) else []) if x in ("verdict","returncode","status","outcome","claim","passed","ok")} for c in r[k]] if isinstance(r[k],list) else r[k])[:1200])'
cd <guest-path> && mkdir -p .coldpass && cat > .coldpass/report.json <<'EOF'
{"outcome":"working","fault_owner":"repo","operation":"Run the documented CI crawl and read crawl findings back over MCP (list_issues), with the local server and scheduler checks","operation_scope":"Pinned commit 4841d0b, Python 3.12.3 venv with requirements.txt; crawls of https://example.com/ (no JavaScript rendering, no Chromium); the README browser install step was not run; palette and router UI tests need a local Chromium and were not run","steps":["git init; git remote add origin https://github.com/spcaeo/toadstone; git fetch --depth 1 origin 4841d0bb9faba944661217542f13710582c66bbc; git reset --mixed FETCH_HEAD","python3 -m venv <guest-path> && <guest-path> install -r requirements.txt","<guest-path> main.py --crawl https://example.com --max-urls 5 --delay 0.5 --fail-on error --report <fresh file> (exit 1, 4 error findings, report written)","<guest-path> main.py --local --port 5057 (background server)","POST /api/crawls {url: https://example.com/, max_urls: 5} -> crawl_id 1 completed","<guest-path> -m src.mcp (stdio) tools/call list_issues {crawl_id:1, severity:error} -> 4 findings including Page has no H1 heading","POST /api/schedules then POST /api/schedules/1/run (manual scheduler cycle)","tests/scheduler_tests.py: 34 passed; tests/mcp_tests.py: 128 passed"],"deviations":["The README browser install step was not run: browser downloads are not permitted in this guest. Crawls run without rendering, and the palette and router UI tests (tests/palette_tests.py, tests/router_tests.py) fail with Executable doesn't exist at ./ms-playwright/chromium_headless_shell. Those tests call p.chromium.launch() with no CDP option, so the supplied CDP endpoint cannot be used by them. Recorded as blocked examples.","CDP check: GET $CDP_URL/json/version returned a JSON body from Chrome/155.0.8059.84 (HTTP status line not captured separately). No browser-dependent product operation was run against it.","The --crawl CLI did not put its crawl in the server database (list_crawls returned 0). To give the MCP server a crawl to read, I created crawl 1 through POST /api/crawls on the local server. The MCP probe and the scheduler cycle need that local server on port 5057 to be running, so validation was run while it was up; the server is stopped after validation.","Checker path: /inputs/coldpass-preflight.py does not exist in this guest, so <guest-path> was run with --validate --replay.","Scheduler defect found (not fixed, source untouched): POST /api/schedules/1/run reports success:true with crawl_id null and creates no crawl. The cause is src/core/crawl/lifecycle.py start_crawl, which only creates a crawl record when session_id is passed, and the scheduled runner (main.py _run_scheduled_crawl) does not pass one. tests/scheduler_tests.py passes anyway, so it does not cover this path. The cycle check records this observed output."],"stuck_step":null,"main_blocker":null,"plain_failure":null,"suggested_fix":"Scheduled runs should create a crawl record and return its id: pass a session id (or create the crawl row) in the scheduled runner path, so run-now and the 30-second scheduler tick produce a readable crawl. Add a test that calls the run-now route and checks a crawl with a non-null id exists. Browser UI tests should accept a CDP endpoint or document the Chromium prerequisite."}
EOF
python3 -m json.tool .coldpass/report.json >/dev/null && echo OK
pkill -f "main.py --local --port 5057"; sleep 3; pgrep -af "main.py --local" || echo "no toadstone server running"; curl -sS -m 3 http://localhost:5057/ >/dev/null 2>&1 && echo STILL_UP || echo PORT_5057_FREE
ps -eo pid,args | grep "[m]ain.py --local" || echo "no toadstone server process"; curl -sS -m 3 http://localhost:5057/ >/dev/null 2>&1 && echo STILL_UP || echo PORT_5057_FREE
cd <guest-path> && <env-var>=<guest-path> python3 -I <guest-path> --validate --replay > <guest-path> 2>&1; echo CHECK_EXIT=$?; python3 -c 'import json;d=json.load(open("<guest-path>"));print("valid",d.get("valid"));print("problems",json.dumps(d.get("problems"))[:1500]);r=d.get("replay",{});print("replay",r.get("status"));print(json.dumps(r.get("details",{}))[:600])' 2>&1 | head -30
cd <guest-path> && (nohup <guest-path> main.py --local --port 5057 > <guest-path> 2>&1 &); for i in $(seq 1 20); do curl -sS -m 2 -o /dev/null http://localhost:5057/api/checks 2>/dev/null && break; sleep 1; done; <env-var>=<guest-path> python3 -I <guest-path> --validate --replay > <guest-path> 2>&1; echo CHECK_EXIT=$?; python3 -c 'import json;d=json.load(open("<guest-path>"));print("valid",d.get("valid"));print("problems",d.get("problems"));print("replay",d["replay"]["status"])'
cd <guest-path> && PID=$(pgrep -f "^<guest-path> main.py --local --port 5057" | head -1); echo "PID=$PID"; [ -n "$PID" ] && kill $PID; sleep 2; curl -sS -m 3 http://localhost:5057/ >/dev/null 2>&1 && echo "PORT STILL UP" || echo "port 5057 free"; python3 - <<'EOF'
import json
p="<guest-path>"
r=json.load(open(p))
d=r.get("deviations")
if not isinstance(d,list): d=[] if d is None else [str(d)]
d.append("Final checker run was executed with the local Toadstone server (main.py --local --port 5057) started, because the MCP probe, list_issues claim and cycle check need a live HTTP backend. The server was stopped by PID after validation passed; an earlier run with the server down failed with 'Connection refused', which is expected.")
r["deviations"]=d
json.dump(r,open(p,"w"),indent=2)
print("report updated")
EOF
<env-var>=<guest-path> python3 -I <guest-path> --validate --replay >/dev/null 2>&1; echo "post-stop recheck exit=$?"