{
  "checker": {
    "details": {
      "checks": [
        {
          "check": "install",
          "details": {
            "argv": [
              "make",
              "install"
            ],
            "blocker": "product invocation failed: {\"returncode\": 2, \"stdout\": \"Installing Dependencies...\\n\\nadded 7 packages, and audited 515 packages in 2s\\n\\n145 packages are looking for funding\\n  run `npm fund` for details\\n\\nfound 0 vulnerabilities\\n\\nadded 4 packages, and audited 367 packages in 1s\\n\\n65 packages are looking for funding\\n  run `npm fund` for details\\n\\n9 vulnerabilities (8 moderate, 1 high)\\n\\nTo address all issues, run:\\n  npm audit fix\\n\\nRun `npm audit` for details.\\nmake[1]: Entering directory '/workspace'\\nmake[1]: Leaving directory '/workspace'\\n\", \"stderr\": \"npm warn EBADENGINE Unsupported engine {\\nnpm warn EBADENGINE   package: 'jsdom@30.0.1',\\nnpm warn EBADENGINE   required: { node: '^22.22.2 || ^24.15.0 || >=26.0.0' },\\nnpm warn EBADENGINE   current: { node: 'v22.14.0', npm: '10.9.2' }\\nnpm warn EBADENGINE }\\nnpm warn EBADENGINE Unsupported engine {\\nnpm warn EBADENGINE   package: 'undici@8.10.2',\\nnpm warn EBADENGINE   required: { node: '>=22.19.0' },\\nnpm warn EBADENGINE   current: { node: 'v22.14.0', npm: '10.9.2' }\\nnpm warn EBADENGINE }\\nfatal: not in a git directory\\nmake[1]: *** [Makefile:77: hooks] Error 128\\nmake: *** [Makefile:69: install] Error 2\\n\", \"needs_credentials\": false, \"needs_browser\": false}",
            "kind": "cli",
            "needs_browser": false,
            "needs_credentials": false,
            "returncode": 2,
            "stderr": "npm warn EBADENGINE Unsupported engine {\nnpm warn EBADENGINE   package: 'jsdom@30.0.1',\nnpm warn EBADENGINE   required: { node: '^22.22.2 || ^24.15.0 || >=26.0.0' },\nnpm warn EBADENGINE   current: { node: 'v22.14.0', npm: '10.9.2' }\nnpm warn EBADENGINE }\nnpm warn EBADENGINE Unsupported engine {\nnpm warn EBADENGINE   package: 'undici@8.10.2',\nnpm warn EBADENGINE   required: { node: '>=22.19.0' },\nnpm warn EBADENGINE   current: { node: 'v22.14.0', npm: '10.9.2' }\nnpm warn EBADENGINE }\nfatal: not in a git directory\nmake[1]: *** [Makefile:77: hooks] Error 128\n[excerpt truncated]",
            "stdout": "Installing Dependencies...\n\nadded 7 packages, and audited 515 packages in 2s\n\n145 packages are looking for funding\n  run `npm fund` for details\n\nfound 0 vulnerabilities\n\nadded 4 packages, and audited 367 packages in 1s\n\n65 packages are looking for funding\n[excerpt truncated]",
            "working": false
          },
          "optional": false,
          "status": "FAIL"
        },
        {
          "check": "start",
          "details": {
            "argv": [
              "make",
              "backend"
            ],
            "blocker": "empty or failed HTTP response",
            "kind": "http",
            "working": false
          },
          "optional": false,
          "status": "FAIL"
        },
        {
          "check": "credentials_error",
          "details": {
            "argv": [
              "make",
              "backend"
            ],
            "blocker": "HTTP server exited: ing\":\"identity\",\"h_user-agent\":\"Python-urllib/3.12\",\"h_connection\":\"close\",\"time\":\"2026-10-18T05:51:49Z\",\"message\":\"CoreMCP call\"}\n{\"level\":\"info\",\"method\":\"GET\",\"host\":\"localhost:3000\",\"path\":\"/mcp\",\"status\":401,\"duration\":0.129358,\"remote\":\"[::1]:60030\",\"time\":\"2026-10-18T05:51:49Z\",\"message\":\"http request\"}\n{\"level\":\"debug\",\"method\":\"GET\",\"path\":\"/mcp\",\"remote\":\"[::1]:60042\",\"h_connection\":\"close\",\"h_accept-encoding\":\"identity\",\"h_user-agent\":\"Python-urllib/3.12\",\"time\":\"2026-10-18T05:51:49Z\",\"message\":\"CoreMCP call\"}\n{\"level\":\"info\",\"method\":\"GET\",\"host\":\"localhost:3000\",\"path\":\"/mcp\",\"status\":401,\"duration\":0.091611,\"remote\":\"[::1]:60042\",\"time\":\"2026-10-18T05:51:49Z\",\"message\":\"http request\"}\n{\"level\":\"info\",\"time\":\"2026-10-18T05:51:49Z\",\"message\":\"[postgres] postgres repository is not enabled, skipping\"}\n{\"level\":\"warn\",\"error\":\"postgres repository is not enabled\",\"time\":\"2026-10-18T05:51:49Z\",\"message\":\"postgres: disabled or failed to initialize, falling back to sqlite\"}\n{\"level\":\"info\",\"time\":\"2026-10-18T05:51:49Z\",\"message\":\"[sqlite] connected\"}\n{\"level\":\"info\",\"retention\":\"168h0m0s\",\"storageDir\":\"./_storage\",\"time\":\"2026-10-18T05:51:49Z\",\"message\":\"cleanup: daily attachment cleanup scheduled (midnight UTC)\"}\n{\"level\":\"info\",\"configured_enabled\":false,\"is_enabled\":false,\"client_id\":\"\",\"time\":\"2026-10-18T05:51:49Z\",\"message\":\"[slack] integration startup status\"}\n{\"level\":\"info\",\"time\":\"2026-10-18T05:51:49Z\",\"message\":\"[telemetry] started controller\"}\n{\"level\":\"info\",\"time\":\"2026-10-18T05:51:49Z\",\"message\":\"[pub_stats] starting stats controller\"}\n{\"level\":\"info\",\"distinct_actions\":0,\"time\":\"2026-10-18T05:51:49Z\",\"message\":\"[pub_stats] loaded baseline counts\"}\n{\"level\":\"info\",\"time\":\"2026-10-18T05:51:49Z\",\"message\":\"[notification] started controller\"}\n{\"level\":\"info\",\"time\":\"2026-10-18T05:51:49Z\",\"message\":\"[push] VAPID keys not configured \u2014 push notifications disabled\"}\n{\"level\":\"info\",\"time\":\"2026-10-18T05:51:49Z\",\"message\":\"scheduler: background poller started (interval: 1m)\"}\n{\"level\":\"info\",\"time\":\"2026-10-18T05:51:49Z\",\"message\":\"telemetryaggregator: background poller started (interval: 1m)\"}\n{\"level\":\"info\",\"time\":\"2026-10-18T05:51:49Z\",\"message\":\"[event-consumer] started controller\"}\n{\"level\":\"info\",\"time\":\"2026-10-18T05:51:49Z\",\"message\":\"[app] started central SSE event forwarder\"}\n{\"level\":\"info\",\"addr\":\":3000\",\"time\":\"2026-10-18T05:51:49Z\",\"message\":\"starting unified HTTP server\"}\n{\"level\":\"fatal\",\"error\":\"listen tcp :3000: bind: address already in use\",\"time\":\"2026-10-18T05:51:49Z\",\"message\":\"run\"}\nmake: *** [Makefile:18: backend] Error 1\n{\"level\":\"debug\",\"method\":\"GET\",\"path\":\"/mcp\",\"remote\":\"[::1]:60054\",\"h_accept-encoding\":\"identity\",\"h_user-agent\":\"Python-urllib/3.12\",\"h_connection\":\"close\",\"time\":\"2026-10-18T05:51:50Z\",\"message\":\"CoreMCP call\"}\n{\"level\":\"info\",\"method\":\"GET\",\"host\":\"localhost:3000\",\"path\":\"/mcp\",\"status\":401,\"duration\":0.091611,\"remote\":\"[::1]:60054\",\"time\":\"2026-10-18T05:51:50Z\",\"message\":\"http request\"}\n",
            "kind": "http",
            "working": false
          },
          "optional": false,
          "status": "FAIL"
        }
      ],
      "scope": "partial checks",
      "working": false
    },
    "status": "FAIL"
  },
  "deviations": [
    "make install failed: frontend npm install, onnxruntime-node install script: getaddrinfo EAI_AGAIN api.nuget.org. Ran npm install --ignore-scripts in frontend and desktop instead; no source changed.",
    "make install (first attempts): npm E429 Too Many Requests from registry.npmjs.org; retried after the Node upgrade.",
    "make install under Node 18.19.1 failed with EBADENGINE (required >=20) and then E429; installed Node 22.14.0 from nodejs.org.",
    "make hooks failed: fatal: not in a git directory. Skipped (only sets core.hooksPath, not needed for run).",
    "Did not run `npx -y @agentrq/agentrq-ws@latest help`: it needs a workspace .mcp.json with a per-workspace URL and token from the logged-in UI."
  ],
  "fault_owner": "prerequisite",
  "main_blocker": "Supervisor MCP requires Google OAuth2 login; the endpoint returns 401 unauthorized with Www-Authenticate Bearer resource_metadata. No credentials are available in the VM and a per-workspace token requires a logged-in UI.",
  "notes": "No source files changed. Generated artifacts in backend/cmd/server (agentrq_binary, .env.jwt-secret, _storage) and node_modules are local build output.",
  "operation": "Start the AgentRQ backend (make backend) and attempt the MCP initialize handshake on the Supervisor/CoreMCP endpoint http://localhost:3000/mcp. The handshake returned 401 unauthorized with an OAuth2 (Google) challenge, so no MCP tools were listed.",
  "operation_scope": "Backend build and HTTP start verified (GET / returns 200). Not exercised: tools/list and any tool call. Unmet prerequisites: Google OAuth2 login for the Supervisor (clientId/clientSecret in backend/cmd/server/_config/base.yaml) and a workspace MCP token minted from a logged-in UI. Neither is available in the VM.",
  "outcome": "blocked",
  "steps": [
    "Read README: Getting Started > Running Locally (make install; make dev) and Supervisor (CoreMCP) sections",
    "Installed Go 1.27.1 to /usr/local/go from go.dev (README requires 1.27.1+; guest had none)",
    "Installed Node 22.14.0 to /opt/node22 from nodejs.org (apt node 18 fails engine >=20 requirement)",
    "apt-get install openssl",
    "go mod download in backend",
    "npm install --ignore-scripts in frontend and desktop",
    "make hooks (not completed, see deviations)",
    "cd backend/cmd/server && go build -o agentrq_binary main.go && ./agentrq_binary (equivalent of make backend) -> listening on :3000",
    "curl GET http://localhost:3000/ -> 200",
    "POST http://localhost:3000/mcp initialize -> 401 unauthorized"
  ],
  "stuck_step": "POST http://localhost:3000/mcp (Supervisor MCP initialize)",
  "suggested_fix": "Provide a Google OAuth2 client (clientId/clientSecret in backend/cmd/server/_config/base.yaml or env), complete the browser login, then run the MCP initialize/tools/list against http://localhost:3000/mcp with the resulting bearer token, or supply a workspace MCP URL with token from the Setup modal to run the agentrq-ws help command. Separately, make install needs api.nuget.org reachable (onnxruntime-node install script) or the install step should use --ignore-scripts; and make hooks should tolerate a non-git checkout."
}
