{
  "checker": {
    "details": {
      "checks": [
        {
          "check": "install",
          "details": {
            "argv": [
              "<host-path>",
              "assemble",
              "--no-daemon"
            ],
            "blocker": "product invocation failed: {\"returncode\": 1, \"stdout\": \"\\nWelcome to Gradle 9.8.1!\\n\\nHere are the highlights of this release:\\n - Java 27 support\\n - Maven mirror settings reuse\\n - Linked problem locations in build output\\n\\nFor more details see https://docs.gradle.org/9.8.1/release-notes.html\\n\\nTo honour the JVM settings for this build a single-use Daemon process will be forked. For more on this, please refer to https://docs.gradle.org/9.8.1/userguide/gradle_daemon.html#sec:disabling_the_daemon in the Gradle documentation.\\nDaemon will be stopped at the end of the build \\n> Task :buildSrc:checkKotlinGradlePluginConfigurationErrors SKIPPED\\n> Task :buildSrc:compileKotlin UP-TO-DATE\\n> Task :buildSrc:compileJava NO-SOURCE\\n> Task :buildSrc:compileGroovy NO-SOURCE\\n> Task :buildSrc:pluginDescriptors UP-TO-DATE\\n> Task :buildSrc:processResources NO-SOURCE\\n> Task :buildSrc:classes UP-TO-DATE\\n> Task :buildSrc:jar UP-TO-DATE\\n3 actionable tasks: 3 up-to-date\\n\", \"stderr\": \"\\nFAILURE: Build failed with an exception.\\n\\n* Where:\\nBuild file '<host-path>' line: 3\\n\\n* What went wrong:\\nPlugin [id: 'org.openrewrite.build.root', version: 'latest.release'] was not found in any of the following sources:\\n\\n- Gradle Core Plugins (plugin is not in 'org.gradle' namespace)\\n- Included Builds (No included builds contain this plugin)\\n- Plugin Repositories (could not resolve plugin artifact 'org.openrewrite.build.root:org.openrewrite.build.root.gradle.plugin:latest.release')\\n  Searched in the following repositories:\\n    codegenome(https://artifacts.codegenomeproject.org/maven)\\n    Gradle Central Plugin Repository\\n\\n* Try:\\n> Run with --stacktrace option to get the stack trace.\\n> Run with --info or --debug option to get more log output.\\n> Get more help at https://help.gradle.org.\\n\\nBUILD FAILED in 5s\\n\", \"needs_credentials\": false, \"needs_browser\": false}",
            "kind": "cli",
            "needs_browser": false,
            "needs_credentials": false,
            "returncode": 1,
            "stderr": "\nFAILURE: Build failed with an exception.\n\n* Where:\nBuild file '<host-path>' line: 3\n\n* What went wrong:\nPlugin [id: 'org.openrewrite.build.root', version: 'latest.release'] was not found in any of the following sources:\n\n- Gradle Core Plugins (plugin is not in 'org.gradle' namespace)\n- Included Builds (No included builds contain this plugin)\n- Plugin Repositories (could not resolve plugin artifact 'org.openrewrite.build.root:org.openrewrite.build.root.gradle.plugin:latest.release')\n[excerpt truncated]",
            "stdout": "\nWelcome to Gradle 9.8.1!\n\nHere are the highlights of this release:\n - Java 27 support\n - Maven mirror settings reuse\n - Linked problem locations in build output\n\nFor more details see https://docs.gradle.org/9.8.1/release-notes.html\n\nTo honour the JVM settings for this build a single-use Daemon process will be forked. For more on this, please refer to https://docs.gradle.org/9.8.1/userguide/gradle_daemon.html#sec:disabling_the_daemon in the Gradle documentation.\nDaemon will be stopped at the end of the build \n[excerpt truncated]",
            "working": false
          },
          "optional": false,
          "status": "FAIL"
        }
      ],
      "scope": "partial checks",
      "working": false
    },
    "status": "FAIL"
  },
  "deviations": [
    "README.md: no runnable command; used CLAUDE.md './gradlew assemble' instead",
    "./gradlew assemble failed: Plugin [id: 'org.openrewrite.build.root', version: 'latest.release'] not found; codegenome repo requires CODEGENOME_USERNAME/CODEGENOME_TOKEN which are unset. Not retried with credentials."
  ],
  "main_blocker": "Missing CODEGENOME_USERNAME / CODEGENOME_TOKEN credentials required to resolve the org.openrewrite build plugin.",
  "operation": "Attempted the CLAUDE.md documented build './gradlew assemble' (Gradle build of the OpenRewrite Java modules). Not completed.",
  "operation_scope": "Gradle wrapper distribution downloaded (gradle-9.8.1). Build cannot resolve plugin org.openrewrite.build.root:latest.release from the codegenome Maven repository (https://artifacts.codegenomeproject.org/maven, declared in settings.gradle.kts) without CODEGENOME_USERNAME and CODEGENOME_TOKEN. Those are not set in this guest and were not obtained. README.md has no install or run commands.",
  "outcome": "blocked",
  "steps": [
    "Read README.md (overview only, no runnable install/run command)",
    "Read CLAUDE.md 'Essential Build Commands' and .github/workflows/ci.yml",
    "apt-get install openjdk-21-jdk-headless (JDK 21.0.12 installed)",
    "./gradlew assemble --no-daemon (NODE_USE_ENV_PROXY=1): wrapper downloaded, plugin resolution failed"
  ],
  "stuck_step": "./gradlew assemble (CLAUDE.md Essential Build Commands)",
  "suggested_fix": "Provide CODEGENOME_USERNAME and CODEGENOME_TOKEN (or codegenomeUsername/codegenomePassword gradle properties) for the guest, then rerun ./gradlew assemble --no-daemon."
}
