{
  "checker": {
    "details": {
      "argv": [
        "make",
        "python-smoke"
      ],
      "blocker": "product invocation failed: {\"returncode\": 2, \"stdout\": \"rm -rf sdk-python/dist\\ncd sdk-python && uv run python -m build && uv run twine check dist/*\\n\", \"stderr\": \"/bin/sh: 1: uv: not found\\nmake: *** [Makefile:315: python-build] Error 127\\n\", \"needs_credentials\": false, \"needs_browser\": false}",
      "kind": "cli",
      "needs_browser": false,
      "needs_credentials": false,
      "returncode": 2,
      "stderr": "/bin/sh: 1: uv: not found\nmake: *** [Makefile:315: python-build] Error 127",
      "stdout": "rm -rf sdk-python/dist\ncd sdk-python && uv run python -m build && uv run twine check dist/*",
      "working": false
    },
    "status": "FAIL"
  },
  "deviations": [
    "Guest had no pip: installed python3-pip and python3-venv via apt, then installed uv into <host-path> with pip (README does not name uv; the sdk-python Makefile targets require it).",
    "Root README quickstart commands for pnpm/Go/CLI were not run: node/pnpm not installed and not needed for the Python SDK operation chosen.",
    "Did not run python-test, python-check, or other unit/lint suites per task instructions."
  ],
  "main_blocker": "product invocation failed: {\"returncode\": 2, \"stdout\": \"rm -rf sdk-python/dist\\ncd sdk-python && uv run python -m build && uv run twine check dist/*\\n\", \"stderr\": \"/bin/sh: 1: uv: not found\\nmake: *** [Makefile:315: python-build] Error 127\\n\", \"needs_credentials\": false, \"needs_browser\": false}",
  "operation": "Build the Python SDK wheel (make python-build) and run the documented CI smoke (make python-smoke): installs the built primitivedotdev wheel into a fresh venv and imports primitive and primitive.api.",
  "operation_scope": "Covers packaging and installation of the Python SDK only. No live Primitive API calls: real send/reply/receive needs a Primitive API key, which was not available in this guest. Node SDK, CLI and Go SDK were not built.",
  "outcome": "blocked",
  "steps": [
    "sudo apt-get install -y python3-pip python3-venv",
    "python3 -m venv <host-path> && pip install uv (uv 0.13.1; installed outside the checkout)",
    "make python-build (uv build of sdk-python; wheel and sdist passed twine check)",
    "make python-smoke (wheel installed into a temp venv; import primitive / primitive.api succeeded)"
  ],
  "stuck_step": "make python-smoke",
  "suggested_fix": null
}
